강의로 돌아가기
이재현

CMakeFiles/solution_test.dir/solution_test.cpp.o: In function `SolutionTest_solution_Test::TestBody()':

G++ 로 이상없이 작동해서 올렸는데
CMakeFiles/solution_test.dir/solution_test.cpp.o: In function `SolutionTest_solution_Test::TestBody()':

이런 에러가 발생하네요;;

혹 이유 아시는분 알려주세요. 참고로 class list 랑 node 만들어서 사용했습니다.

  • 이재현
    정확한 에러는 이재현 2018.08.09 17:47
  • 이재현
    CMakeFiles/solution_test.dir/solution_test.cpp.o: In function `SolutionTest_solution_Test::TestBody()': solution_test.cpp:(.text+0xad): undefined reference to `solution(std::__cxx11::basic_string<char, std::char_traits<char>, std::allocator<char> >)' clang: error: linker command failed with exit code 1 (use -v to see invocation) make[2]: *** [solution_test] Error 1 make[1]: *** [CMakeFiles/solution_test.dir/all] Error 2 make: *** [all] Error 2 입니다 이재현 2018.08.09 17:47
0 개의 답변
답변 쓰기
이 입력폼은 마크다운 문법을 지원합니다. 마크다운 가이드 를 참고하세요.