강의로 돌아가기
최정

컴파일 오류가 납니다.

다른 프로그램(코드블럭, 비주얼 스튜디오)에서는 컴파일러로 정상적으로 읽히고 실행도 원활하게 되는데 여기서는 안되네요 무슨 문제일까요?

CMakeFiles/solutiontest.dir/solutiontest.cpp.o: In function SolutionTest_solution_Test::TestBody()':
solution_test.cpp:(.text+0x26): undefined reference to
solution[abi:cxx11](int)'
clang: error: linker command failed with exit code 1 (use -v to see invocation)
make[2]: *** [solutiontest] Error 1
make[1]: *** [CMakeFiles/solution
test.dir/all] Error 2
make: *** [all] Error 2

이것이 오류 메시지입니다.

1 개의 답변
Demi

안녕하세요. 보다 정확한 에러 파악을 위해, 제출하신 코드를 함께 올려주실 수 있는지요?

답변 쓰기
이 입력폼은 마크다운 문법을 지원합니다. 마크다운 가이드 를 참고하세요.